{"text_format":"1","workbook":"xlsx","n_sheets":11,"sheets":["Formulario Autoevaluación L1","Sostenibilidad","RolesIgualdad","Años","LargoSerie","PLAT","SíNo","%","FESTIS ","TIPO en equipo","Tipo EPROY"],"not_rendered":{"charts":0,"images":1,"macros":1,"external_links":0,"defined_names":2,"comments":0,"pivot_tables":0},"unopened":[],"bounds":{"document_bytes":16777216,"sheet_cells":100000,"rows_first":2000,"rows_last":500,"rows_between":2000,"halvings":0,"cell_chars":16384,"cell_head_chars":4096},"cells_cut":0,"cells_raw":0,"read":"whole","date_system":"1900"}

{"sheet":"Formulario Autoevaluación L1","index":0,"n_rows":154,"n_cols":9,"rows_kept":154,"cut":false,"hidden":false,"merged":[[35,0,35,2],[36,0,36,2],[37,0,37,2],[48,0,48,1],[101,0,101,5],[60,0,60,6],[91,0,91,1],[66,0,66,6],[72,0,72,6],[78,0,78,5],[79,0,79,5],[85,0,85,5],[82,0,82,5],[86,0,86,5],[80,0,80,1],[83,0,83,1],[0,0,0,8],[1,0,1,8],[2,0,2,8],[3,0,3,8],[4,0,4,8],[5,2,5,3],[5,5,5,8],[6,4,6,5],[7,0,7,8],[8,0,8,8],[6,0,6,1],[6,6,6,8],[6,2,6,3],[51,0,51,1],[34,0,34,2],[108,0,108,5],[94,0,94,5],[9,0,9,5],[33,0,33,2],[49,0,49,1],[50,0,50,1],[47,0,47,1],[18,0,18,5],[12,0,12,6],[19,0,19,6],[31,0,31,6],[11,0,11,5],[39,0,39,2],[58,0,58,5],[59,0,59,5],[90,0,90,1],[88,0,88,1],[95,0,95,1],[97,0,97,5],[87,0,87,1],[89,0,89,5],[92,0,92,5],[81,0,81,1],[93,0,93,5],[84,0,84,1],[126,0,126,8],[127,0,127,5],[129,0,129,5],[98,0,98,1],[96,0,96,1],[119,0,119,5],[124,0,124,7],[99,0,99,1],[100,0,100,5],[109,0,109,3],[117,0,117,5],[153,0,153,7],[154,0,154,7],[134,0,134,5],[140,0,140,5],[145,0,145,5],[152,0,152,7]]}
["CONVOCATORIA PÚBLICA AYUDAS DIRIGIDAS AL SECTOR AUDIOVISUAL 2024"]
["COORDINACIÓN GENERAL DE ALCALDÍA | DG DE RRII Y PROYECTOS ESTRATÉGICOS"]
["Si necesita más filas en alguno de los criterios, haga doble clic en cualquier celda del apartado correspondiente. En el mensaje que le aparezca, pulse \"Finalizar\"."]
["CUESTIONARIO DE AUTOEVALUACIÓN | LÍNEA 1"]
["Datos generales "]
["Empresa solicitante ",null,null,null,"Título del proyecto "]
["Residencia fiscal en CAM ",null,null,null,"Proyecto vinculado a Madrid "]
[]
["Valoración criterios técnicos"]
[null,null,null,null,null,null,"Puntuación máxima ","Suma Puntos","Puntuación obtenida"]
["Trayectoria de la entidad productora solicitante",null,null,null,null,null,5,null,{"$f":"I12+I19","v":0}]
["Relevancia artística de los proyectos estrenados en los últimos siete años (15 años en el caso de animación)",null,null,null,null,null,2.5,{"$f":"SUM(E15:E19)","v":0},{"$f":"IF(H12<2.5,H12,IF(H12=2.5,H12,IF(H12>2.5,2.5)))","v":0}]
["Presencia en los festivales y ceremonias de premios Anexo I de las bases de las obras estrenadas en los últimos 7 años (15 años en el caso de animación)"]
["Título ","Seleccione festival/Premio","Premio S/N",null,"Puntuación"]
[null,null,null,null,{"$f":"_xlfn.IFS(C15=\"Sí\",VLOOKUP(B15,'FESTIS '!A3:D100,4,FALSE),C15=\"No\",VLOOKUP(B15,'FESTIS '!A3:D100,3,FALSE),C15=\"\",0)","v":0}]
[null,null,null,null,{"$f":"_xlfn.IFS(C16=\"Sí\",VLOOKUP(B16,'FESTIS '!A4:D101,4,FALSE),C16=\"No\",VLOOKUP(B16,'FESTIS '!A4:D101,3,FALSE),C16=\"\",0)","v":0}]
[null,null,null,null,{"$f":"_xlfn.IFS(C17=\"Sí\",VLOOKUP(B17,'FESTIS '!A4:D101,4,FALSE),C17=\"No\",VLOOKUP(B17,'FESTIS '!A4:D101,3,FALSE),C17=\"\",0)","v":0}]
[null,null,null,null,{"$f":"_xlfn.IFS(C18=\"Sí\",VLOOKUP(B18,'FESTIS '!A4:D101,4,FALSE),C18=\"No\",VLOOKUP(B18,'FESTIS '!A4:D101,3,FALSE),C18=\"\",0)","v":0}]
["Relevancia comercial de los proyectos estrenados en los últimos siete años (15 años en el caso de animación)",null,null,null,null,null,2.5,{"$f":"H20+H26+H32+H46","v":0},{"$f":"IF(H19<2.5,H19,IF(H19=2.5,H19,IF(H19>2.5,2.5)))","v":0}]
["Audiencia en salas ",null,null,null,null,null,null,{"$f":"SUM(E22:E26)","v":0}]
["Título ","Año de estreno","Espectadores ",null,"Puntuación"]
[null,null,null,null,{"$f":"IF(C22>46000,0.5,IF(C22<27000,0,0.25))","v":0}]
[null,null,null,null,{"$f":"IF(C23>46000,0.5,IF(C23<27000,0,0.25))","v":0}]
[null,null,null,null,{"$f":"IF(C24>46000,0.5,IF(C24<27000,0,0.25))","v":0}]
[null,null,null,null,{"$f":"IF(C25>46000,0.5,IF(C25<27000,0,0.25))","v":0}]
["Taquilla internacional acumulada",null,null,null,null,null,null,{"$f":"SUM(E28:E32)","v":0}]
["Título ","Año de estreno","Espectadores acumulados",null,"Puntuación"]
[null,null,null,null,{"$f":"IF(C28>5000000,0.5,IF(C28<2300000,0, 0.25))","v":0}]
[null,null,null,null,0]
[null,null,null,null,0]
[null,null,null,null,0]
["Plataformas de vídeo bajo demanda de pago",null,null,"Nombre plataforma ",null,null,null,{"$f":"H34+H39","v":0}]
["Largometrajes"]
["Título ",null,null,"Plataforma","Puntuación",null,null,{"$f":"SUM(E35:E39)","v":0}]
[null,null,null,null,{"$f":"IF(D35<>\"\",VLOOKUP(D35,PLAT!A$1:C$9,2,FALSE),IF(D35=\"\",0))","v":0}]
[null,null,null,null,{"$f":"IF(D36<>\"\",VLOOKUP(D36,PLAT!A$1:C$9,2,FALSE),IF(D36=\"\",0))","v":0}]
[null,null,null,null,{"$f":"IF(D37<>\"\",VLOOKUP(D37,PLAT!A$1:C$9,2,FALSE),IF(D37=\"\",0))","v":0}]
[null,null,null,null,{"$f":"IF(D38<>\"\",VLOOKUP(D38,PLAT!A$1:C$9,2,FALSE),IF(D38=\"\",0))","v":0}]
["Series",null,null,null,null,null,null,{"$f":"SUM(E41:E46)","v":0}]
["Título ","Número de capítulos",null,"Plataforma","Puntuación "]
[null,null,null,null,{"$f":"_xlfn.IFS(B41=0,0,B41=\"\",0,B41<>\"\",VLOOKUP(D41,PLAT!A$1:C$9,3,FALSE))*B41","v":0}]
[null,null,null,null,{"$f":"_xlfn.IFS(B42=0,0,B42=\"\",0,B42<>\"\",VLOOKUP(D42,PLAT!A$1:C$9,3,FALSE))*B42","v":0}]
[null,null,null,null,{"$f":"_xlfn.IFS(B43=0,0,B43=\"\",0,B43<>\"\",VLOOKUP(D43,PLAT!A$1:C$9,3,FALSE))*B43","v":0}]
[null,null,null,null,{"$f":"_xlfn.IFS(B44=0,0,B44=\"\",0,B44<>\"\",VLOOKUP(D44,PLAT!A$1:C$9,3,FALSE))*B44","v":0}]
[null,null,null,null,{"$f":"_xlfn.IFS(B45=0,0,B45=\"\",0,B45<>\"\",VLOOKUP(D45,PLAT!A$1:C$9,3,FALSE))*B45","v":0}]
["Televisiones o plataformas bajo demanda gratuitas",null,null,null,null,null,null,{"$f":"H47+H53","v":0}]
["Largometrajes",null,null,null,null,null,null,{"$f":"SUM(E49:E53)","v":0}]
["Título ",null,"Plataforma","Internacional S/N","Puntuación"]
[null,null,null,null,{"$f":"IF(D49=\"Sí\",1,IF(D49=\"No\",0.5,))","v":0}]
[null,null,null,null,{"$f":"IF(D50=\"Sí\",1,IF(D50=\"No\",0.5,))","v":0}]
[null,null,null,null,{"$f":"IF(D51=\"Sí\",1,IF(D51=\"No\",0.5,))","v":0}]
[null,null,null,null,{"$f":"IF(D52=\"Sí\",1,IF(D52=\"No\",0.5,))","v":0}]
["Series",null,null,null,null,null,null,{"$f":"SUM(E55:E59)","v":0}]
["Título ","Número de capítulos","Plataforma","Internacional S/N","Puntuación "]
[null,null,null,null,{"$f":"(IF(D55=\"Sí\",0.5,IF(D55=\"No\",0.25,)))*B55","v":0}]
[null,null,null,null,{"$f":"(IF(D56=\"Sí\",0.5,IF(D56=\"No\",0.25,)))*B56","v":0}]
[null,null,null,null,{"$f":"(IF(D57=\"Sí\",0.5,IF(D57=\"No\",0.25,)))*B57","v":0}]
[null,null,null,null,{"$f":"(IF(D58=\"Sí\",0.5,IF(D58=\"No\",0.25,)))*B58","v":0}]
["Calidad artística y técnica del proyecto presentado",null,null,null,null,null,50,null,{"$f":"I60+I79+I86","v":0}]
["Equipo (trayectoria)",null,null,null,null,null,15,{"$f":"H61+H67+H73","v":0},{"$f":"IF(H60<15,H60,IF(H60=15,H60,IF(H60>15,15)))","v":0}]
["Productor/a ejecutivo/a ",null,null,null,null,null,null,{"$f":"SUM(E63:E67)","v":0}]
["Título ","Tipo ","Número (solo para episodios de una serie)",null,"Puntuación"]
[null,null,null,null,{"$f":"_xlfn.IFS(A63=\"\",0,B63=\"Episodio de una serie\",(VLOOKUP(B63,LargoSerie!A$6:B$10,2,FALSE)*C63),B63<>\"Episodio de una serie\",VLOOKUP(B63,LargoSerie!A$6:B411,2,FALSE))","v":0}]
[null,null,null,null,{"$f":"_xlfn.IFS(A64=\"\",0,B64=\"Episodio de una serie\",(VLOOKUP(B64,LargoSerie!A$6:B$10,2,FALSE)*C64),B64<>\"Episodio de una serie\",VLOOKUP(B64,LargoSerie!A$6:B411,2,FALSE))","v":0}]
[null,null,null,null,{"$f":"_xlfn.IFS(A65=\"\",0,B65=\"Episodio de una serie\",(VLOOKUP(B65,LargoSerie!A$6:B$10,2,FALSE)*C65),B65<>\"Episodio de una serie\",VLOOKUP(B65,LargoSerie!A$6:B415,2,FALSE))","v":0}]
[null,null,null,null,{"$f":"_xlfn.IFS(A66=\"\",0,B66=\"Episodio de una serie\",(VLOOKUP(B66,LargoSerie!A$6:B$10,2,FALSE)*C66),B66<>\"Episodio de una serie\",VLOOKUP(B66,LargoSerie!A$6:B416,2,FALSE))","v":0}]
["Director ",null,null,null,null,null,null,{"$f":"SUM(E69:E73)","v":0}]
["Título ","Tipo ","Número (solo para episodios de una serie)",null,"Puntuación"]
[null,null,null,null,{"$f":"_xlfn.IFS(A69=\"\",0,B69=\"Episodio de una serie\",(VLOOKUP(B69,LargoSerie!A$6:B$10,2,FALSE)*C69),B69<>\"Episodio de una serie\",VLOOKUP(B69,LargoSerie!A$6:B$10,2,FALSE))","v":0}]
[null,null,null,null,{"$f":"_xlfn.IFS(A70=\"\",0,B70=\"Episodio de una serie\",(VLOOKUP(B70,LargoSerie!A$6:B$10,2,FALSE)*C70),B70<>\"Episodio de una serie\",VLOOKUP(B70,LargoSerie!A$6:B$10,2,FALSE))","v":0}]
[null,null,null,null,{"$f":"_xlfn.IFS(A71=\"\",0,B71=\"Episodio de una serie\",(VLOOKUP(B71,LargoSerie!A$6:B$10,2,FALSE)*C71),B71<>\"Episodio de una serie\",VLOOKUP(B71,LargoSerie!A$6:B$10,2,FALSE))","v":0}]
[null,null,null,null,{"$f":"_xlfn.IFS(A72=\"\",0,B72=\"Episodio de una serie\",(VLOOKUP(B72,LargoSerie!A$6:B$10,2,FALSE)*C72),B72<>\"Episodio de una serie\",VLOOKUP(B72,LargoSerie!A$6:B$10,2,FALSE))","v":0}]
["Guionista",null,null,null,null,null,null,{"$f":"SUM(E75:E79)","v":0}]
["Título ","Tipo ","Número (solo para episodios de una serie)",null,"Puntuación"]
[null,null,null,null,{"$f":"_xlfn.IFS(A75=\"\",0,B75=\"Episodio de una serie\",(VLOOKUP(B75,LargoSerie!A$6:B$10,2,FALSE)*C75),B75<>\"Episodio de una serie\",VLOOKUP(B75,LargoSerie!A$6:B$10,2,FALSE))","v":0}]
[null,null,null,null,{"$f":"_xlfn.IFS(A76=\"\",0,B76=\"Episodio de una serie\",(VLOOKUP(B76,LargoSerie!A$6:B$10,2,FALSE)*C76),B76<>\"Episodio de una serie\",VLOOKUP(B76,LargoSerie!A$6:B$10,2,FALSE))","v":0}]
[null,null,null,null,{"$f":"_xlfn.IFS(A77=\"\",0,B77=\"Episodio de una serie\",(VLOOKUP(B77,LargoSerie!A$6:B$10,2,FALSE)*C77),B77<>\"Episodio de una serie\",VLOOKUP(B77,LargoSerie!A$6:B$10,2,FALSE))","v":0}]
[null,null,null,null,{"$f":"_xlfn.IFS(A78=\"\",0,B78=\"Episodio de una serie\",(VLOOKUP(B78,LargoSerie!A$6:B$10,2,FALSE)*C78),B78<>\"Episodio de una serie\",VLOOKUP(B78,LargoSerie!A$6:B$10,2,FALSE))","v":0}]
["Componentes artísticos y técnicos de la propuesta",null,null,null,null,null,25,{"$f":"H80+H83","v":0},{"$f":"IF(H79<25,H79,IF(H79=25,H79,IF(H79>25,25)))","v":0}]
["Componentes artísticos",null,null,null,null,null,20,{"$f":"IF(I82<>\"Completar argumentación\",I82,0)","v":0}]
[null,null,"Argumentación ",null,"Puntuación"]
[null,null,null,null,null,null,20,null,{"$f":"IF(C82=\"\",\"Completar argumentación\",E82)","v":"Completar argumentación"}]
["Componentes técnicos ",null,null,null,null,null,5,{"$f":"IF(I85<>\"Completar argumentación\",I85,0)","v":0}]
[null,null,"Argumentación ",null,"Puntuación"]
[null,null,null,null,null,null,5,null,{"$f":"IF(C85=\"\",\"Completar argumentación\",E85)","v":"Completar argumentación"}]
["Viabilidad del proyecto",null,null,null,null,null,10,{"$f":"H87+H90","v":0},{"$f":"IF(H86<10,H86,IF(H86=10,H86,IF(H86>10,10)))","v":0}]
["Adecuación del proyecto a la previsión presupuestaria",null,"Argumentación ",null,"Puntuación",null,5,{"$f":"IF(I89<>\"Completar argumentación\",I89,0)","v":0}]
[null,null,"Argumentación ",null,"Puntuación"]
[null,null,null,null,null,null,5,null,{"$f":"IF(C89=\"\",\"Completar argumentación\",E89)","v":"Completar argumentación"}]
["Adecuación del plan de producción y el plan de financiación a las características del proyecto",null,"Argumentación ",null,"Puntuación",null,5,{"$f":"IF(I92<>\"Completar argumentación\",I92,0)","v":0}]
[null,null,"Argumentación ",null,"Puntuación"]
[null,null,null,null,null,null,5,null,{"$f":"IF(C92=\"\",\"Completar argumentación\",E92)","v":"Completar argumentación"}]
["Promoción estratégica de Madrid",null,null,null,null,null,45,null,{"$f":"I94+I101+I120","v":0}]
["Presencia de Madrid en la obra",null,null,"Puntuación",null,null,20,{"$f":"H95+H98","v":0},{"$f":"IF(H94<20,H94,IF(H94=20,H94,IF(H94>20,20)))","v":0}]
["Contenido",null,null,null,null,null,10,{"$f":"IF(I97<>\"Completar argumentación\",I97,0)","v":0}]
[null,null,"Argumentación ",null,"Puntuación"]
[null,null,null,null,null,null,null,null,{"$f":"IF(C97=\"\",\"Completar argumentación\",E97)","v":"Completar argumentación"}]
["Localizaciones",null,null,null,null,null,10,{"$f":"IF(I100<>\"Completar argumentación\",I100,0)","v":0}]
[null,null,"Argumentación ",null,"Puntuación"]
[null,null,null,null,null,null,10,null,{"$f":"IF(C100=\"\",\"Completar argumentación\",E100)","v":"Completar argumentación"}]
["Proyección nacional e internacional",null,null,"Puntuación",null,null,15,{"$f":"H102+H109+H118","v":0},{"$f":"IF(H101<15,H101,IF(H101=15,15,IF(H101>15,15)))","v":0}]
["Nacional: Contratos con empresas distribuidoras, televisiones o plataformas en línea",null,null,null,null,null,5,{"$f":"SUM(E104:E109)","v":0}]
["Nombre de la empresa","Tipo ",null,null,"Puntuación"]
[null,null,null,null,{"$f":"_xlfn.IFS(A104=\"\",0,B104=\"\",0,B104<>\"\",2)","v":0}]
[null,null,null,null,{"$f":"_xlfn.IFS(A105=\"\",0,B105=\"\",0,B105<>\"\",2)","v":0}]
[null,null,null,null,{"$f":"_xlfn.IFS(A106=\"\",0,B106=\"\",0,B106<>\"\",2)","v":0}]
[null,null,null,null,{"$f":"_xlfn.IFS(A107=\"\",0,B107=\"\",0,B107<>\"\",2)","v":0}]
[null,null,null,null,{"$f":"_xlfn.IFS(A108=\"\",0,B108=\"\",0,B108<>\"\",2)","v":0}]
["Internacional: países en los que la obra será accesible",null,null,null,null,null,7,{"$f":"SUM(E111:E118)","v":0}]
["País",null,null,null,"Puntuación"]
[null,null,null,null,{"$f":"IF(A111=\"\",0,1)","v":0}]
[null,null,null,null,0]
[null,null,null,null,0]
[null,null,null,null,0]
[null,null,null,null,0]
[null,null,null,null,{"$f":"IF(A116=\"\",0,1)","v":0}]
[null,null,null,null,{"$f":"IF(A117=\"\",0,1)","v":0}]
["Coproducción internacional ",null,null,null,null,null,3,{"$f":"E119","v":0}]
["Producción en régimen de coproducción internacional con participación técnico artística española",null,null,null,{"$f":"IF(B119=\"SÍ\",3,0)","v":0}]
["Promoción económica de Madrid ",null,null,"Puntuación",null,null,10,{"$f":"E122+E124","v":0},{"$f":"IF(H120<10,H120,IF(H120=10,10,IF(H120>10,10)))","v":0}]
{"$rows_left_out":35}
{"sheet":"Sostenibilidad","index":1,"n_rows":2,"n_cols":2,"rows_kept":2,"cut":false,"hidden":true,"merged":[]}
["Contrato firmado",6]
["Carta de compromiso del profesional o entidad",3]

{"sheet":"RolesIgualdad","index":2,"n_rows":7,"n_cols":6,"rows_kept":7,"cut":false,"hidden":true,"merged":[]}
[null,1,"<100%",null,null,"Contrato firmado"]
["Dirección",2,{"$f":"B2/2","v":1},null,null,"Carta de compromiso firmada"]
["Guionista",2,{"$f":"B3/2","v":1}]
["Producción ejecutiva",2,1]
["Dirección de fotografía ",1.5,0.75]
["Composición de música",1.5,0.75]
["Jefa de equipo técnico",1,0.5]

{"sheet":"Años","index":3,"n_rows":5,"n_cols":1,"rows_kept":5,"cut":false,"hidden":true,"merged":[]}
[2023]
[2022]
[2021]
[2020]
[2019]

{"sheet":"LargoSerie","index":4,"n_rows":10,"n_cols":2,"rows_kept":10,"cut":false,"hidden":true,"merged":[]}
["Largometraje"]
["Serie"]
[]
[]
[]
["Largometraje",1.5]
["Serie entera",1.5]
["Episodio de una serie",1]
["Cortometraje",0.5]
["Videoclip",0.5]

{"sheet":"PLAT","index":5,"n_rows":10,"n_cols":3,"rows_kept":10,"cut":false,"hidden":true,"merged":[]}
["NETFLIX",1,0.5]
["AMAZON",1,0.5]
["DISNEY +",1,0.5]
["HBO ",1,0.5]
["FILMIN",0.5,0.25]
["RAKUTEN",0.5,0.25]
["ORANGE TV",0.5,0.25]
["VODAFONE",0.5,0.25]
["MOVISTAR",0.5,0.25]
["OTRA"]

{"sheet":"SíNo","index":6,"n_rows":2,"n_cols":1,"rows_kept":2,"cut":false,"hidden":true,"merged":[]}
["Sí"]
["No"]

{"sheet":"%","index":7,"n_rows":4,"n_cols":2,"rows_kept":4,"cut":false,"hidden":true,"merged":[]}
["Más del 75%","9 puntos"]
["Hasta el 75%","7 puntos"]
["Hasta el 50 %","5 puntos"]
["Hasta el 25%","3 puntos"]

{"sheet":"FESTIS ","index":8,"n_rows":100,"n_cols":4,"rows_kept":100,"cut":false,"hidden":true,"merged":[]}
["FESTIVALES"]
[null,"Festivales internacionales"]
["Festivales","País","Participación","Participación y premio"]
["Internationale Filmfestspiele Berlin. Berlinale","Alemania",1,2]
["Stuttgart International Festival of Animated Films (ITFS)","Alemania",0.5,1]
["Internationales Leipziger Festival fúr Dokumentar-und Animationsfilm (DOK Leipzig)","Alemania",0.5,1]
["Festival Internacional de Cine de Mar del Plata","Argentina",0.5,1]
["BAFICI – Buenos Aires Festival Internacional de Cine Independiente","Argentina",0.5,1]
["Sydney Film Festival","Australia",0.5,1]
["Viennale Festival","Austria",0.5,1]
["Anima - Brussels International Animation Film Festival","Bélgica",0.5,1]
["Sofia International Film Festival","Bulgaria",0.5,1]
["Toronto International Film Festival","Canadá",0.5,1]
["Hot Docs Canadian International Documentary Festival","Canadá",0.5,1]
["Ottawa International Animation Festival","Canadá",0.5,1]
["Montreal Film Festival (World Film Festival)","Canadá ",0.5,1]
["Chilemonos","Chile",0.5,1]
["Shanghai International Film Festival","China",0.5,1]
["Festival Internacional de Cine de Cartagena de Indias","Colombia",0.5,1]
["Busan International Film Festival","Corea del Sur",0.5,1]
["CPH:DOX","Dinamarca",0.5,1]
["Sundance Film Festival","Estados Unidos",0.5,1]
["Tribeca Film Festival","Estados Unidos",0.5,1]
["SXSW Film Festival Austin","Estados Unidos",0.5,1]
["New York Film Festival","Estados",0.5,1]
["Fantastic Fest Austin","Estados Unidos",0.5,1]
["Animation is Film Festival","Estados Unidos",0.5,1]
["Doc NYC","Estados Unidos",0.5,1]
["Cairo International Film Festival","Egipto",0.5,1]
["Tallin Black Nights Film Festival","Estonia",0.5,1]
["Festival de Cannes","Francia",1,2]
["Festival international du film d'animation d'Annecy","Francia",0.5,1]
["Cinema du reel","Francia",0.5,1]
["Fid Marseille","Francia",0.5,1]
["SeriesMania ","Francia ",0.5,1]
["Thessaloniki Documentary Festival","Grecia",0.5,1]
["Goa IFFI - India International Film Festival","India",0.5,1]
["JIO Mami - Mumbai Film Festival India","India",0.5,1]
["La Biennale di Venezia / Mostra Internazionale d'Arte Cinematografica","Italia",1,2]
["Torino Film Festival","Italia",0.5,1]
["Cartoons on the Bay, Pulcinella Awards","Italia",0.5,1]
["Tokyo International Film Festival (TIFF)","Japón",0.5,1]
["Festival Internacional de Cine de Guadalajara (FICG)","México",0.5,1]
["DocsMX","México",0.5,1]
["International Film Festival Rotterdam","Países Bajos",0.5,1]
["International Documentary Film Festival Amsterdam (IDFA)","Países Bajos",0.5,1]
["Warsaw International Film Festival","Polonia",0.5,1]
["Indie Lisboa Film Festival","Portugal",0.5,1]
["DOC Lisboa","Portugal",0.5,1]
["Cinanima","Portugal",0.5,1]
["London Film Festival (BFI)","Reino Unido",0.5,1]
["SheffieldDocFest","Reino Unido",0.5,1]
["Karlovy Vary International Film Festival","República Checa",0.5,1]
["Ji.hlava IDFF","República Checa",0.5,1]
["Transilvania International Film Festival","Rumanía",0.5,1]
["Moscow International Film Festival","Rusia",0.5,1]
["Stockholm Film Festival","Suecia",0.5,1]
["Nordisk Panorama","Suecia",0.5,1]
["Festival del Film Locarno","Suiza",0.5,1]
["Internacional Film Festival Nyon (Visions du Réel)","Suiza",0.5,1]
["Istanbul Film Festival","Turquía",0.5,1]
["Kyiv International Film Festival, Molodist.","Ucrania",0.5,1]
[null,"Festivales nacionales","Participación","Participación y premio"]
["Abycine","Albacete",0.5,1]
["D`A Film Festival","Barcelona",0.5,1]
["Festival Internacional de Documentales DocsBarcelona","Barcelona",1,1.5]
["L’Alternativa","Barcelona",0.5,1]
["Serielizados Fest","Barcelona, Madrid, online",0.5,1]
["Festival Internacional de Cine Documental y Cortometraje de Bilbao ZINEBI","Bilbao",1,1]
["Alcances","Cádiz",0.5,1]
["Donostia Zinemaldia ¡ Festival de Cine de San Sebastián ¡ International Film Festival","Donostia",1,2]
["Festival Internacional de Cine de Gijón","Gijón",0.5,1]
["Festival de Huelva de cine Iberoamericano","Huelva",0.5,1]
["Festival Internacional de Documentales DocumentaMadrid","Madrid",1,1.5]
["Festival Internacional de Cine&Cultura Entrelazada (RIZOMA)","Madrid",0.5,1]
["Festival de Málaga","Málaga",0.5,1]
["Festival Internacional de Cine de Las Palmas de Gran Canaria","Las Palmas de Gran Canaria",0.5,1]
["Animayo","Las Palmas de Gran Canaria",0.5,1]
["Festival Punto de Vista","Pamplona",0.5,1]
["Play-Doc Tui","Pontevedra",0.5,1]
["Weird. Festival internacional de Cortometrajes de animación (antes 3D Wire)","Segovia",0.5,1]
["Festival de Cine Europeo de Sevilla","Sevilla",0.5,1.5]
["Sitges. Festival Internacional de Cinema Fantàstic de Catalunya.","Sitges",0.5,1.5]
["Cinema Jove","Valencia",0.5,1]
["Semana Internacional de Cine de Valladolid (Seminci).","Valladolid",0.5,1.5]
["Premio","Lugar","Nominación","Nominación y premio"]
["Premios Goya (Academia de las Artes y las Ciencias Cinematográficas de España)","España",1,3]
["Premios  Quirino  de la Animación Iberoamericana","España",0.5,1]
["Premios Forqué (Entidad de Gestión de Derechos de los Productores Audiovisuales)","España",0.5,1]
["Premios Feroz (Asociación de Informadores Cinematográficos de España)","España",0.5,1]
["Premios Iris (Academia de Televisión y de las Ciencias y Artes del Audiovisual)","España ",0.5,1]
["Premios Platino del Cine Iberoamericano (Entidad de Gestión de Derechos de los Productores Audiovisuales, en colaboración con la Federación Iberoamericana de Productores Cinematográficos y Audiovisuales)","Iberoamérica",0.5,1]
["Premios Oscar (Academia de las Artes y Ciencias Cinematográficas de Hollywood) / The Oscars (Academy of Motion Picture Arts and Sciences).","Estados Unidos",1,3]
["Premios Globos de Oro (Asociación de la Prensa Extranjera de Hollywood) / Golden Globe Awards (The Hollywood Foreign Press Association).","Estados Unidos",1,3]
["Premios Emmy Internacional (Academia Internacional de las Artes y Ciencias de la Televisión) / International Emmy Awards (The International Academy of Television Arts & Sciences)","Estados Unidos",1,3]
["Premios ANNIE (Premios de la Asociación Internacional de Cine de Animación)","Estados Unidos",1,3]
["Premios de Cine Europeo EFA (Academia de Cine Europeo)/ European Film Awards EFA (European Film Academy).","Europa",0.5,1]
["Premios de Animación Europea / European Animation Awards. Emile Awards (The European Animation Awards Association) ","Francia",0.5,1]
["Premios CÉSAR (Premios de Cine de la Academia Francesa)","Francia",0.5,1]
["Premios BAFTA (Premios de Cine de la Academia Británica)","Reino Unido",0.5,1]

{"sheet":"TIPO en equipo","index":9,"n_rows":3,"n_cols":1,"rows_kept":3,"cut":false,"hidden":true,"merged":[]}
["Largometraje o serie entera de ficción documental: 1,5 puntos por obra."]
["Episodio de una serie: 1 puntos por episodio."]
["Cortometraje o videoclip: 0,5 puntos por cortometraje o videoclip"]

{"sheet":"Tipo EPROY","index":10,"n_rows":3,"n_cols":1,"rows_kept":3,"cut":false,"hidden":true,"merged":[]}
["Distribuidora"]
["Televisión"]
["Plataforma en línea"]