{"text_format":"1","workbook":"xlsx","n_sheets":14,"sheets":["AUTOEVALUACIÓN L2","LargoSerie","PLAT","SíNo","Sostenibilidad","RolesIgualdad","%","FESTIS ","ACREDoPRES","TIPO en equipo","Tipo EPROY","CCAA","PRODDIST","IDIOMAS"],"not_rendered":{"charts":0,"images":1,"macros":1,"external_links":0,"defined_names":2,"comments":0,"pivot_tables":0},"unopened":[],"bounds":{"document_bytes":16777216,"sheet_cells":100000,"rows_first":2000,"rows_last":500,"rows_between":2000,"halvings":0,"cell_chars":16384,"cell_head_chars":4096},"cells_cut":0,"cells_raw":0,"read":"whole","date_system":"1900"}

{"sheet":"AUTOEVALUACIÓN L2","index":0,"n_rows":191,"n_cols":9,"rows_kept":191,"cut":false,"hidden":false,"merged":[[184,0,184,5],[189,0,189,7],[190,0,190,7],[165,0,165,8],[166,0,166,5],[168,0,168,5],[173,0,173,5],[179,0,179,5],[157,0,157,3],[158,0,158,3],[161,0,161,3],[162,0,162,3],[113,0,113,6],[125,5,125,6],[126,0,126,6],[156,0,156,5],[160,0,160,6],[149,0,149,5],[159,0,159,5],[143,0,143,6],[146,0,146,6],[127,0,127,6],[115,0,115,6],[72,0,72,3],[79,0,79,3],[5,1,5,3],[7,1,7,3],[6,1,6,3],[67,0,67,3],[66,0,66,3],[36,0,36,6],[12,0,12,5],[11,0,11,1],[65,0,65,1],[65,2,65,3],[51,0,51,6],[71,0,71,3],[73,0,73,6],[78,0,78,5],[79,5,79,6],[75,0,75,3],[74,0,74,3],[21,0,21,6],[90,0,90,5],[69,0,69,5],[76,0,76,5],[70,0,70,6],[80,1,80,3],[80,5,80,6],[84,0,84,3],[85,0,85,3],[88,0,88,3],[89,0,89,3],[89,5,89,6],[85,5,85,6],[96,0,96,5],[97,0,97,5],[114,0,114,6],[82,5,82,6],[95,5,95,6],[110,0,110,3],[111,0,111,3],[112,0,112,5],[91,0,91,3],[92,0,92,3],[92,5,92,6],[83,0,83,5],[87,0,87,5],[93,0,93,5],[98,0,98,5],[163,0,163,7],[68,0,68,1],[0,0,0,8],[1,0,1,8],[2,0,2,8],[3,0,3,8],[4,0,4,8],[5,5,5,8],[6,4,6,5],[8,0,8,8],[9,0,9,8],[6,6,6,8],[7,4,7,5],[7,6,7,8],[10,0,10,5],[13,0,13,6]]}
["CONVOCATORIA PÚBLICA AYUDAS DIRIGIDAS AL SECTOR AUDIOVISUAL 2024"]
["COORDINACIÓN GENERAL DE ALCALDÍA | DG DE RRII Y PROYECTOS ESTRATÉGICOS"]
["Si necesita más filas en alguno de los criterios, haga doble clic en cualquier celda del apartado correspondiente. En el mensaje que le aparezca, pulse \"Finalizar\"."]
["CUESTIONARIO DE AUTOEVALUACIÓN | LÍNEA 2"]
["Datos Generales "]
["Empresa solicitante ",null,null,null,"Título del proyecto "]
["Residencia fiscal en CAM ","No",null,null,"Película vinculada a Madrid "]
["Tipo ",null,null,null,"Película que cumple con los criterios 2 y 3 del apartado b) de la base cuarta"]
[]
["Valoración criterios técnicos"]
[null,null,null,null,null,null,"Puntuación máxima ","Suma Puntos","Puntuación obtenida"]
["Trayectoria de la entidad solicitante",null,null,null,null,null,5,{"$f":"H13+H21","v":0},{"$f":"SUM(I13,I21)","v":0}]
["Relevancia artística de los proyectos estrenados en los últimos siete años",null,null,null,null,null,2.5,{"$f":"SUM(E16:E21)","v":0},{"$f":"IF(H13<2.5,H13,IF(H13=2.5,H13,IF(H13>2.5,2.5)))","v":0}]
["Presencia en los festivales y ceremonias de premios Anexo I de las bases de las obras estrenadas en los últimos 7 años (15 años en el caso de animación)"]
["Título ","Seleccione festival/Premio","Premio S/N",null,"Puntuación "]
[null,null,null,null,{"$f":"_xlfn.IFS(C16=\"Sí\",VLOOKUP(B16,'FESTIS '!A3:D100,4,FALSE),C16=\"No\",VLOOKUP(B16,'FESTIS '!A3:D100,3,FALSE),C16=\"\",0)","v":0}]
[null,null,null,null,{"$f":"_xlfn.IFS(C17=\"Sí\",VLOOKUP(B17,'FESTIS '!A4:D101,4,FALSE),C17=\"No\",VLOOKUP(B17,'FESTIS '!A4:D101,3,FALSE),C17=\"\",0)","v":0}]
[null,null,null,null,{"$f":"_xlfn.IFS(C18=\"Sí\",VLOOKUP(B18,'FESTIS '!A6:D103,4,FALSE),C18=\"No\",VLOOKUP(B18,'FESTIS '!A6:D103,3,FALSE),C18=\"\",0)","v":0}]
[null,null,null,null,{"$f":"_xlfn.IFS(C19=\"Sí\",VLOOKUP(B19,'FESTIS '!A6:D103,4,FALSE),C19=\"No\",VLOOKUP(B19,'FESTIS '!A6:D103,3,FALSE),C19=\"\",0)","v":0}]
[null,null,null,null,{"$f":"_xlfn.IFS(C20=\"Sí\",VLOOKUP(B20,'FESTIS '!A6:D103,4,FALSE),C20=\"No\",VLOOKUP(B20,'FESTIS '!A6:D103,3,FALSE),C20=\"\",0)","v":0}]
["Relevancia comercial de los proyectos estrenados en los últimos siete años (15 años en el caso de animación)",null,null,null,null,null,2.5,{"$f":"SUM(H22,H29,H37,H44,H52,H60)","v":0},{"$f":"IF(H21<2.5,H21,IF(H21=2.5,H21,IF(H21>2.5,2.5)))","v":0}]
["Audiencia en salas nacionales",null,null,null,null,null,null,{"$f":"SUM(E24:E29)","v":0}]
["Título ","Año de estreno","Espectadores ",null,"Puntuación"]
[null,null,null,null,{"$f":"IF(C24>46000,0.5,IF(C24<27000,0,0.25))","v":0}]
[null,null,null,null,{"$f":"IF(C25>46000,0.5,IF(C25<27000,0,0.25))","v":0}]
[null,null,null,null,{"$f":"IF(C26>46000,0.5,IF(C26<27000,0,0.25))","v":0}]
[null,null,null,null,{"$f":"IF(C27>46000,0.5,IF(C27<27000,0,0.25))","v":0}]
[null,null,null,null,{"$f":"IF(C28>46000,0.5,IF(C28<27000,0,0.25))","v":0}]
["Taquilla internacional acumulada",null,null,null,null,null,null,{"$f":"SUM(E31:E36)","v":0}]
["Título ","Año de estreno","Espectadores acumulados",null,"Puntuación"]
[null,null,null,null,{"$f":"IF(C31>5000000,0.5,IF(C31<2300000,0, 0.25))","v":0}]
[null,null,null,null,{"$f":"IF(C32>5000000,0.5,IF(C32<2300000,0, 0.25))","v":0}]
[null,null,null,null,{"$f":"IF(C33>5000000,0.5,IF(C33<2300000,0, 0.25))","v":0}]
[null,null,null,null,{"$f":"IF(C34>5000000,0.5,IF(C34<2300000,0, 0.25))","v":0}]
[null,null,null,null,{"$f":"IF(C35>5000000,0.5,IF(C35<2300000,0, 0.25))","v":0}]
["Plataformas de vídeo bajo demanda de pago"]
["Largometrajes",null,null,null,null,null,null,{"$f":"SUM(E39:E44)","v":0}]
["Título ",null,"Plataforma",null,"Puntuación"]
[null,null,null,null,{"$f":"IF(C39<>\"\",VLOOKUP(C39,PLAT!A$1:C$9,2,FALSE),IF(C39=\"\",0))","v":0}]
[null,null,null,null,{"$f":"IF(C40<>\"\",VLOOKUP(C40,PLAT!A$1:C$9,2,FALSE),IF(C40=\"\",0))","v":0}]
[null,null,null,null,{"$f":"IF(C41<>\"\",VLOOKUP(C41,PLAT!A$1:C$9,2,FALSE),IF(C41=\"\",0))","v":0}]
[null,null,null,null,{"$f":"IF(C42<>\"\",VLOOKUP(C42,PLAT!A$1:C$9,2,FALSE),IF(C42=\"\",0))","v":0}]
[null,null,null,null,{"$f":"IF(C43<>\"\",VLOOKUP(C43,PLAT!A$1:C$9,2,FALSE),IF(C43=\"\",0))","v":0}]
["Series",null,null,null,null,null,null,{"$f":"SUM(E46:E51)","v":0}]
["Título ","Número de capítulos","Plataforma",null,"Puntuación "]
[null,null,null,null,{"$f":"(_xlfn.IFS(B46=0,0,B46=\"\",0,B46<>\"\",VLOOKUP(C46,PLAT!A$1:C$9,3,FALSE))*B46)","v":0}]
[null,null,null,null,{"$f":"(_xlfn.IFS(B47=0,0,B47=\"\",0,B47<>\"\",VLOOKUP(C47,PLAT!A$1:C$9,3,FALSE))*B47)","v":0}]
[null,null,null,null,{"$f":"(_xlfn.IFS(B48=0,0,B48=\"\",0,B48<>\"\",VLOOKUP(C48,PLAT!A$1:C$9,3,FALSE))*B48)","v":0}]
[null,null,null,null,{"$f":"(_xlfn.IFS(B49=0,0,B49=\"\",0,B49<>\"\",VLOOKUP(C49,PLAT!A$1:C$9,3,FALSE))*B49)","v":0}]
[null,null,null,null,{"$f":"(_xlfn.IFS(B50=0,0,B50=\"\",0,B50<>\"\",VLOOKUP(C50,PLAT!A$1:C$9,3,FALSE))*B50)","v":0}]
["Televisiones o plataformas bajo demanda gratuitas"]
["Largometrajes",null,null,null,null,null,null,{"$f":"SUM(E54:E59)","v":0}]
["Título ",null,"Plataforma","Internacional S/N","Puntuación"]
[null,null,null,null,{"$f":"IF(D54=\"Sí\",1,IF(D54=\"No\",0.5,))","v":0}]
[null,null,null,null,{"$f":"IF(D55=\"Sí\",1,IF(D55=\"No\",0.5,))","v":0}]
[null,null,null,null,{"$f":"IF(D56=\"Sí\",1,IF(D56=\"No\",0.5,))","v":0}]
[null,null,null,null,{"$f":"IF(D57=\"Sí\",1,IF(D57=\"No\",0.5,))","v":0}]
[null,null,null,null,{"$f":"IF(D58=\"Sí\",1,IF(D58=\"No\",0.5,))","v":0}]
["Series"]
["Título ","Número de capítulos","Plataforma","Internacional S/N","Puntuación ",null,null,{"$f":"SUM(E61:E66)","v":0}]
[null,null,null,null,{"$f":"(IF(D61=\"Sí\",0.5,IF(D61=\"No\",0.25,)))*B61","v":0}]
[null,null,null,null,{"$f":"(IF(D62=\"Sí\",0.5,IF(D62=\"No\",0.25,)))*B62","v":0}]
[null,null,null,null,{"$f":"(IF(D63=\"Sí\",0.5,IF(D63=\"No\",0.25,)))*B63","v":0}]
[null,null,null,null,{"$f":"(IF(D64=\"Sí\",0.5,IF(D64=\"No\",0.25,)))*B64","v":0}]
[null,null,null,null,{"$f":"(IF(D65=\"Sí\",0.5,IF(D65=\"No\",0.25,)))*B65","v":0}]
["Calidad artística, técnica, interés y originalidad de la obra ",null,null,null,null,null,5,{"$f":"IF(I66=\"Completar argumentación\",0,I66)","v":0},{"$f":"IF(ISBLANK(A68),\"Completar argumentación\", E68)","v":"Completar argumentación"}]
["Argumentación ",null,null,null,"Puntuación propuesta"]
[]
["Promoción estratégica de Madrid",null,null,null,null,null,40,null,{"$f":"H70+H77","v":0}]
["Presencia de Madrid en la obra",null,null,null,null,null,20,{"$f":"SUM(H71,H74)","v":0},{"$f":"H70","v":0}]
["Contenido",null,null,null,null,null,null,{"$f":"IF(I71=\"Completar argumentación\",0,I71)","v":0},{"$f":"IF(A73=\"\",\"Completar argumentación\",E73)","v":"Completar argumentación"}]
["Argumentación ",null,null,null,"Puntuación propuesta"]
[null,null,null,null,null,null,10]
["Localizaciones",null,null,null,null,null,null,{"$f":"IF(I74=\"Completar argumentación\",0,I74)","v":0},{"$f":"IF(A76=\"\",\"Completar argumentación\",E76)","v":"Completar argumentación"}]
["Argumentación ",null,null,null,"Puntuación propuesta"]
[null,null,null,null,null,null,10]
["Proyección nacional e internacional e impacto económico",null,null,null,null,null,20,{"$f":"IF(I77=\"No pueden cumplimentarse ambas\",0,I77)","v":0},{"$f":"_xlfn.IFS(H78=0,H87,H87=0,H78,H78<>0+H87<>0,\"No pueden cumplimentarse ambas\")","v":0}]
["SOLO PARA SOLICITANTES QUE PRESENTE UNA PELÍCULA QUE NO CUMPLA CON LOS CRITERIOS 2 y 3 DEL APARTADO B) DE LA BASE CUARTA",null,null,null,null,null,null,{"$f":"H84+H79","v":0}]
["Impacto económico",null,null,null,null,null,10,{"$f":"SUM(E81,E83)","v":0},{"$f":"IF(H79<10,H79,IF(H79=10,10,IF(H79>10,10)))","v":0}]
[null,null,null,null,"Puntuación "]
["Entidad solicitante con residencia fiscal en la CAM ",null,null,null,{"$f":"IF(B81=\"Sí\",2,0)","v":0}]
["Presupuesto total de promoción y distribución","Presupuesto a ejecutar en la CAM","% Presupuesto a ejecutar en la CAM"]
[null,null,{"$f":"IF(A83<>\"\",B83/A83,0)","v":0},null,{"$f":"_xlfn.IFS(C83=0%,0,C83<=25%,2,C83<=50%,4,C83<=75%,6,C83>75%,8)","v":0}]
["Acciones de promoción en la ciudad de Madrid",null,null,null,null,null,10,{"$f":"IF(I84=\"Completar argumentación\",0,I84)","v":0},{"$f":"IF(A86=\"\",\"Completar argumentación\",E86)","v":"Completar argumentación"}]
["Argumentación ",null,null,null,"Puntuación propuesta"]
[]
["SOLO PARA SOLICITANTES QUE PRESENTE UNA PELÍCULA QUE SÍ CUMPLA CON LOS CRITERIOS 2 y 3 DEL APARTADO B) DE LA BASE CUARTA",null,null,null,null,null,null,{"$f":"SUM(H88,H91,H94)","v":0}]
["Entidad solicitante con residencia fiscal en la CAM ",null,null,null,null,null,4,{"$f":"E90","v":0},{"$f":"H88","v":0}]
["S/N",null,null,null,"Puntuación "]
[]
["Acciones de promoción ",null,null,null,null,null,13,{"$f":"IF(I91=\"Completar argumentación\",0,I91)","v":0},{"$f":"IF(A93=\"\", \"Completar argumentación\",E93)","v":"Completar argumentación"}]
["Argumentación ",null,null,null,"Puntuación propuesta"]
[]
["Contribución a la internacionalización: acuerdos con empresas distribuidoras, televisiones, plataformas en línea o agencia de ventas internacionales.",null,null,null,null,null,3,{"$f":"IF(I94=\"Completar argumentación\",0,I94)","v":0},{"$f":"IF(C96=\"\",\"Completar argumentación\",E96)","v":"Completar argumentación"}]
["Nombre de la empresa","Tipo ","Argumentación ",null,"Puntuación propuesta"]
[null,null,null,null,null,null,null,{"$f":"E96","v":0}]
["Calidad de la estrategia de promoción y distribución",null,null,null,null,null,50,{"$f":"SUM(H98,H110,H113,H143)","v":0},{"$f":"I98+H110+H113+I143+I150+H157+H160","v":0}]
["Recorrido por festivales y certámenes nacionales e internacionales. ",null,null,null,null,null,5,{"$f":"H99+H105","v":0},{"$f":"IF(H99<5,H99,IF(H99=5,H99,IF(H99>5,5)))","v":0}]
["Festivales o certámenes relacionados en el Anexo I ",null,null,null,null,null,null,{"$f":"SUM(E101:E105)","v":0}]
["Seleccione festival/Premio","Presencia / solicitud ",null,null,"Puntuación "]
[null,null,null,null,{"$f":"_xlfn.IFS(A101=\"\",0,B101=\"Presencia acreditada\",1,B101=\"Solicitud de acceso \",0.5)","v":0}]
[null,null,null,null,{"$f":"_xlfn.IFS(A102=\"\",0,B102=\"Presencia acreditada\",1,B102=\"Solicitud de acceso \",0.5)","v":0}]
[null,null,null,null,{"$f":"_xlfn.IFS(A103=\"\",0,B103=\"Presencia acreditada\",1,B103=\"Solicitud de acceso \",0.5)","v":0}]
[null,null,null,null,{"$f":"_xlfn.IFS(A104=\"\",0,B104=\"Presencia acreditada\",1,B104=\"Solicitud de acceso \",0.5)","v":0}]
["Otros festivales o certámenes de la CAM ",null,null,null,null,null,null,{"$f":"SUM(E107:E110)","v":0}]
["Indique festival o certámen ","Municipio","Presencia / solicitud ",null,"Puntuación "]
[null,null,null,null,{"$f":"_xlfn.IFS(A107=\"\",0,C107=\"Presencia acreditada\",1,C107=\"Solicitud de acceso \",0.5)","v":0}]
[null,null,null,null,{"$f":"_xlfn.IFS(A108=\"\",0,C108=\"Presencia acreditada\",1,C108=\"Solicitud de acceso \",0.5)","v":0}]
[null,null,null,null,{"$f":"_xlfn.IFS(A109=\"\",0,C109=\"Presencia acreditada\",1,C109=\"Solicitud de acceso \",0.5)","v":0}]
["Diseño de actividades y materiales de difusión",null,null,null,null,null,10,{"$f":"IF(I110=\"Completar argumentación\",0,I110)","v":0},{"$f":"IF(A112=\"\",\"Completar argumentación\",E112)","v":"Completar argumentación"}]
["Argumentación ",null,null,null,"Puntuación propuesta"]
[]
["Plan de distribución",null,null,null,null,null,15,null,{"$f":"_xlfn.IFS(H114=0,H126,H126=0,H114,H114<>0+H126<>0,\"No pueden cumplimentarse ambas\")","v":0}]
["SOLO PARA SOLICITANTES QUE PRESENTEN PELÍCULAS QUE NO CUMPLEN CON LOS CRITERIOS 2 y 3 DEL APARTADO B) DE LA BASE CUARTA",null,null,null,null,null,null,{"$f":"_xlfn.IFS(H115<15,H115,H115=15,H115,H115>15,15)","v":0}]
["Nacional",null,null,null,null,null,null,{"$f":"SUM(H116,H121)","v":0}]
["Salas acreditadas ",null,null,null,null,null,null,{"$f":"SUM(E118:E121)","v":0}]
["CC.AA",null,null,null,"Puntuación "]
[null,null,null,null,{"$f":"IF(A118=\"\",0,2)","v":0}]
[null,null,null,null,{"$f":"IF(A119=\"\",0,2)","v":0}]
[null,null,null,null,{"$f":"IF(A120=\"\",0,2)","v":0}]
{"$rows_left_out":72}
{"sheet":"LargoSerie","index":1,"n_rows":10,"n_cols":2,"rows_kept":10,"cut":false,"hidden":true,"merged":[]}
["Largometraje"]
["Serie"]
[]
[]
[]
["Largometraje",1.5]
["Serie entera",1.5]
["Episodio de una serie",1]
["Cortometraje",0.5]
["Videoclip",0.5]

{"sheet":"PLAT","index":2,"n_rows":10,"n_cols":3,"rows_kept":10,"cut":false,"hidden":true,"merged":[]}
["NETFLIX",1,0.5]
["AMAZON",1,0.5]
["DISNEY +",1,0.5]
["HBO ",1,0.5]
["FILMIN",0.5,0.25]
["RAKUTEN",0.5,0.25]
["ORANGE TV",0.5,0.25]
["VODAFONE",0.5,0.25]
["MOVISTAR",0.5,0.25]
["OTRA"]

{"sheet":"SíNo","index":3,"n_rows":2,"n_cols":1,"rows_kept":2,"cut":false,"hidden":true,"merged":[]}
["Sí"]
["No"]

{"sheet":"Sostenibilidad","index":4,"n_rows":2,"n_cols":2,"rows_kept":2,"cut":false,"hidden":true,"merged":[]}
["Contrato firmado",7]
["Carta de compromiso del profesional o entidad",3]

{"sheet":"RolesIgualdad","index":5,"n_rows":3,"n_cols":6,"rows_kept":3,"cut":false,"hidden":true,"merged":[]}
[null,1,"<100%",null,null,"Contrato firmado"]
["Agente de ventas",5,{"$f":"B2/2","v":2.5},null,null,"Carta de compromiso firmada"]
["Encargada del plan de promoción y distribución",5,{"$f":"B3/2","v":2.5}]

{"sheet":"%","index":6,"n_rows":5,"n_cols":3,"rows_kept":5,"cut":false,"hidden":true,"merged":[]}
["Más del 75%",8]
["Hasta el 75%",6]
["Hasta el 50 %",5]
["Hasta el 25%",2]
[null,null,"L2"]

{"sheet":"FESTIS ","index":7,"n_rows":100,"n_cols":4,"rows_kept":100,"cut":false,"hidden":true,"merged":[]}
["FESTIVALES"]
[null,"Festivales internacionales"]
["Festivales","País","Participación","Participación y premio"]
["Internationale Filmfestspiele Berlin. Berlinale","Alemania",1,2]
["Stuttgart International Festival of Animated Films (ITFS)","Alemania",0.5,1]
["Internationales Leipziger Festival fúr Dokumentar-und Animationsfilm (DOK Leipzig)","Alemania",0.5,1]
["Festival Internacional de Cine de Mar del Plata","Argentina",0.5,1]
["BAFICI – Buenos Aires Festival Internacional de Cine Independiente","Argentina",0.5,1]
["Sydney Film Festival","Australia",0.5,1]
["Viennale Festival","Austria",0.5,1]
["Anima - Brussels International Animation Film Festival","Bélgica",0.5,1]
["Sofia International Film Festival","Bulgaria",0.5,1]
["Toronto International Film Festival","Canadá",0.5,1]
["Hot Docs Canadian International Documentary Festival","Canadá",0.5,1]
["Ottawa International Animation Festival","Canadá",0.5,1]
["Montreal Film Festival (World Film Festival)","Canadá ",0.5,1]
["Chilemonos","Chile",0.5,1]
["Shanghai International Film Festival","China",0.5,1]
["Festival Internacional de Cine de Cartagena de Indias","Colombia",0.5,1]
["Busan International Film Festival","Corea del Sur",0.5,1]
["CPH:DOX","Dinamarca",0.5,1]
["Sundance Film Festival","Estados Unidos",0.5,1]
["Tribeca Film Festival","Estados Unidos",0.5,1]
["SXSW Film Festival Austin","Estados Unidos",0.5,1]
["New York Film Festival","Estados",0.5,1]
["Fantastic Fest Austin","Estados Unidos",0.5,1]
["Animation is Film Festival","Estados Unidos",0.5,1]
["Doc NYC","Estados Unidos",0.5,1]
["Cairo International Film Festival","Egipto",0.5,1]
["Tallin Black Nights Film Festival","Estonia",0.5,1]
["Festival de Cannes","Francia",1,2]
["Festival international du film d'animation d'Annecy","Francia",0.5,1]
["Cinema du reel","Francia",0.5,1]
["Fid Marseille","Francia",0.5,1]
["SeriesMania ","Francia ",0.5,1]
["Thessaloniki Documentary Festival","Grecia",0.5,1]
["Goa IFFI - India International Film Festival","India",0.5,1]
["JIO Mami - Mumbai Film Festival India","India",0.5,1]
["La Biennale di Venezia / Mostra Internazionale d'Arte Cinematografica","Italia",1,2]
["Torino Film Festival","Italia",0.5,1]
["Cartoons on the Bay, Pulcinella Awards","Italia",0.5,1]
["Tokyo International Film Festival (TIFF)","Japón",0.5,1]
["Festival Internacional de Cine de Guadalajara (FICG)","México",0.5,1]
["DocsMX","México",0.5,1]
["International Film Festival Rotterdam","Países Bajos",0.5,1]
["International Documentary Film Festival Amsterdam (IDFA)","Países Bajos",0.5,1]
["Warsaw International Film Festival","Polonia",0.5,1]
["Indie Lisboa Film Festival","Portugal",0.5,1]
["DOC Lisboa","Portugal",0.5,1]
["Cinanima","Portugal",0.5,1]
["London Film Festival (BFI)","Reino Unido",0.5,1]
["SheffieldDocFest","Reino Unido",0.5,1]
["Karlovy Vary International Film Festival","República Checa",0.5,1]
["Ji.hlava IDFF","República Checa",0.5,1]
["Transilvania International Film Festival","Rumanía",0.5,1]
["Moscow International Film Festival","Rusia",0.5,1]
["Stockholm Film Festival","Suecia",0.5,1]
["Nordisk Panorama","Suecia",0.5,1]
["Festival del Film Locarno","Suiza",0.5,1]
["Internacional Film Festival Nyon (Visions du Réel)","Suiza",0.5,1]
["Istanbul Film Festival","Turquía",0.5,1]
["Kyiv International Film Festival, Molodist.","Ucrania",0.5,1]
[null,"Festivales nacionales","Participación","Participación y premio"]
["Abycine","Albacete",0.5,1]
["D`A Film Festival","Barcelona",0.5,1]
["Festival Internacional de Documentales DocsBarcelona","Barcelona",1,1.5]
["L’Alternativa","Barcelona",0.5,1]
["Serielizados Fest","Barcelona, Madrid, online",0.5,1]
["Festival Internacional de Cine Documental y Cortometraje de Bilbao ZINEBI","Bilbao",1,1]
["Alcances","Cádiz",0.5,1]
["Donostia Zinemaldia ¡ Festival de Cine de San Sebastián ¡ International Film Festival","Donostia",1,2]
["Festival Internacional de Cine de Gijón","Gijón",0.5,1]
["Festival de Huelva de cine Iberoamericano","Huelva",0.5,1]
["Festival Internacional de Documentales DocumentaMadrid","Madrid",1,1.5]
["Festival Internacional de Cine&Cultura Entrelazada (RIZOMA)","Madrid",0.5,1]
["Festival de Málaga","Málaga",0.5,1]
["Festival Internacional de Cine de Las Palmas de Gran Canaria","Las Palmas de Gran Canaria",0.5,1]
["Animayo","Las Palmas de Gran Canaria",0.5,1]
["Festival Punto de Vista","Pamplona",0.5,1]
["Play-Doc Tui","Pontevedra",0.5,1]
["Weird. Festival internacional de Cortometrajes de animación (antes 3D Wire)","Segovia",0.5,1]
["Festival de Cine Europeo de Sevilla","Sevilla",0.5,1.5]
["Sitges. Festival Internacional de Cinema Fantàstic de Catalunya.","Sitges",0.5,1.5]
["Cinema Jove","Valencia",0.5,1]
["Semana Internacional de Cine de Valladolid (Seminci).","Valladolid",0.5,1.5]
["Premio","Lugar","Nominación","Nominación y premio"]
["Premios Goya (Academia de las Artes y las Ciencias Cinematográficas de España)","España",1,3]
["Premios  Quirino  de la Animación Iberoamericana","España",0.5,1]
["Premios Forqué (Entidad de Gestión de Derechos de los Productores Audiovisuales)","España",0.5,1]
["Premios Feroz (Asociación de Informadores Cinematográficos de España)","España",0.5,1]
["Premios Iris (Academia de Televisión y de las Ciencias y Artes del Audiovisual)","España ",0.5,1]
["Premios Platino del Cine Iberoamericano (Entidad de Gestión de Derechos de los Productores Audiovisuales, en colaboración con la Federación Iberoamericana de Productores Cinematográficos y Audiovisuales)","Iberoamérica",0.5,1]
["Premios Oscar (Academia de las Artes y Ciencias Cinematográficas de Hollywood) / The Oscars (Academy of Motion Picture Arts and Sciences).","Estados Unidos",1,3]
["Premios Globos de Oro (Asociación de la Prensa Extranjera de Hollywood) / Golden Globe Awards (The Hollywood Foreign Press Association).","Estados Unidos",1,3]
["Premios Emmy Internacional (Academia Internacional de las Artes y Ciencias de la Televisión) / International Emmy Awards (The International Academy of Television Arts & Sciences)","Estados Unidos",1,3]
["Premios ANNIE (Premios de la Asociación Internacional de Cine de Animación)","Estados Unidos",1,3]
["Premios de Cine Europeo EFA (Academia de Cine Europeo)/ European Film Awards EFA (European Film Academy).","Europa",0.5,1]
["Premios de Animación Europea / European Animation Awards. Emile Awards (The European Animation Awards Association) ","Francia",0.5,1]
["Premios CÉSAR (Premios de Cine de la Academia Francesa)","Francia",0.5,1]
["Premios BAFTA (Premios de Cine de la Academia Británica)","Reino Unido",0.5,1]

{"sheet":"ACREDoPRES","index":8,"n_rows":2,"n_cols":1,"rows_kept":2,"cut":false,"hidden":true,"merged":[]}
["Presencia acreditada"]
["Solicitud de acceso "]

{"sheet":"TIPO en equipo","index":9,"n_rows":3,"n_cols":1,"rows_kept":3,"cut":false,"hidden":true,"merged":[]}
["Largometraje o serie entera de ficción documental: 1,5 puntos por obra."]
["Episodio de una serie: 1 puntos por episodio."]
["Cortometraje o videoclip: 0,5 puntos por cortometraje o videoclip"]

{"sheet":"Tipo EPROY","index":10,"n_rows":4,"n_cols":1,"rows_kept":4,"cut":false,"hidden":true,"merged":[]}
["Distribuidora"]
["Televisión"]
["Plataforma en línea"]
["Agencia de ventas internacionales"]

{"sheet":"CCAA","index":11,"n_rows":19,"n_cols":1,"rows_kept":19,"cut":false,"hidden":true,"merged":[]}
["Andalucía"]
["Aragón"]
["Asturias, Principado de"]
["Balears, Illes"]
["Canarias"]
["Cantabria"]
["Castilla y León"]
["Castilla-La Mancha"]
["Cataluña"]
["Comunitat Valenciana"]
["Extremadura"]
["Galicia"]
["Madrid, Comunidad de"]
["Murcia, Región de"]
["Navarra, Comunidad Foral de"]
["País Vasco"]
["Rioja, La"]
["Ceuta"]
["Melilla"]

{"sheet":"PRODDIST","index":12,"n_rows":2,"n_cols":1,"rows_kept":2,"cut":false,"hidden":true,"merged":[]}
["Productora"]
["Distribuidora"]

{"sheet":"IDIOMAS","index":13,"n_rows":10,"n_cols":4,"rows_kept":10,"cut":false,"hidden":true,"merged":[]}
["Español",0.5,null,"https://mpt.gob.es/dam/es/portal/politica-territorial/autonomica/Lenguas-cooficiales/Consejo-de-Lenguas-Cooficiales/Informes/INFORME-DIAGNOSTICO-LENGUAS-2019.pdf#page=1"]
["Euskera",0.5]
["Gallego",0.5]
["Valenciano",0.5]
["Catalán",0.5]
["Aranés",0.5]
[]
["Inglés",1.5]
["Francés",1.5]
["Otro idioma",0.5]